START lib/libcrypto/symbols 2025-03-13T01:04:16Z ==== all_tests ==== make -f /usr/src/regress/lib/libcrypto/symbols/Makefile include_headers.c; awk -f /usr/src/regress/lib/libcrypto/symbols/symbols.awk < /usr/src/lib/libcrypto/Symbols.list > symbols.c.tmp; mv -f symbols.c.tmp symbols.c mv include_headers.c.tmp include_headers.c cc -O2 -pipe -Wno-deprecated-declarations -DUSE_LIBRESSL_NAMESPACE -g -MD -MP -lcrypto -Wl,--no-allow-shlib-undefined -o symbols symbols.c symbols.c:7166:15: error: use of undeclared identifier 'PKCS12_key_gen_uni' static typeof(PKCS12_key_gen_uni) *_libre_PKCS12_key_gen_uni; ^ symbols.c:28438:13: error: use of undeclared identifier 'PKCS12_key_gen_uni' .addr = &PKCS12_key_gen_uni, ^ symbols.c:35732:24: error: invalid application of 'sizeof' to an incomplete type 'struct (unnamed struct at symbols.c:12996:2)[]' for (i = 0; i < sizeof(symbols) / sizeof(symbols[0]); i++) ^~~~~~~~~ 3 errors generated. *** Error 1 in . (:85 'symbols') FAILED FAIL lib/libcrypto/symbols *** Error 1 in . (:85 'symbols')